Error C2511 Overloaded


How to ACTUALLY fix the OBS encoding overload ERROR

RECOMMENDED: If you have Windows errors then we strongly recommend that you download and run this (Windows) Repair Tool.

Compiler Errors C2500 Through C2599 | Microsoft Docs – The articles in this part of the documentation contain information about a subsection of the Visual C++ compiler errors. You can access the information here or, in.

Script function not found: doGet – codesd.com – Script function not found: doGet I keep getting this error message when I try to click "Test web app for. Error C2511 – Overloaded Member Function Not Found.

Error C2511: Overloaded member function not found. C / C++ Forums on Bytes.

Note: C++ does not support default-int – C++ Forum – Oct 06, 2011  · 1 2 3 4 5 6 7 8 9 10: #include <iostream> #include "Book.h" #include <string> using namespace std; void BookType::AddBook(int.

, as you declared in people.h. However, it is better to use const references instead of copying object, but it is not your problem here.

Note For information about Visual Studio 2017, see What’s new for Visual C++ in Visual Studio 2017 and Conformance Improvements in Visual C++ in Visual Studio 2017.

Google Toolbar Error During Installation If you use the toolbar’s search box, you’re sent to “an IAC Mywebsearch results page with advertisements and search results syndicated from Google. to install the Ask toolbar at all, although it does install with Chrome 24. An error. Des années que j’utilise et en fais la promo de votre

Got an error on my C++ program. It is likely to be something simple as I have only just started programming. The error is: Error 1 error C2511: 'void BMI::getWeight.

This is the error im recieving. Error 4 error C2511: 'Vector<T> Menus::sortListBy(sortType,Vector<T>)' : overloaded member function not found in 'Menus.

Apr 10, 2005. "error C2535: '__thiscall rectangle::rectangle(void)' : member function. and SettingsChrisCpp1.cpp(46) : error C2511: 'getWidth' : overloaded.

c:documents and settingsadmindesktopgestprinc.cpp(35) : error C2511: ' getAnno' : overloaded member function 'int (void)' not found in.

error C2511: 'int. Init(const CObArray&,INT,INT,const int)' : overloaded member function not found in 'CTmuxResponseCounted' The error points to.

Hi, when I try and compile the following code, I'm getting this error: error C2511: 'Employee::Employee(void)' : overloaded member function not found in 'Employee'

RECOMMENDED: Click here to fix Windows errors and improve system performance