Error Endianness Must Be Declared For This Processor


RECOMMENDED: If you have Windows errors then we strongly recommend that you download and run this (Windows) Repair Tool.

Hey! Socket programming got you down? Is this stuff just a little too difficult to figure out from the man pages? You want to do cool Internet programming, but you.

Endianness must be declared for this processor Well that's more a.h header include file issue. Aparently a define or declaration is missing. What else.

Informix Odbc Function Sequence Error Windows Parity Check Memory Parity Error The message was ??MI Parity Check Memory Parity Error. My favorite was when Windows decided it wasn't Genuine and tried to stop Microsoft Security. I have aDell Inspiron E1705 laptop with Win XP Pro, SP3. I have 2 memory modules of 1 GB each

High-quality software, or low-defect software, is often costly to develop. This is a common experience in safety-critical systems development, whether the development.

249 # error Endianness must be declared for this processor. 250. 270 # error Endianness must be declared for this processor. 271.

Asterisk 12 rc1 doesn't. error: #error Endianness must be declared for this. error Endianness must be declared for this processor.

You should have received a copy of the GNU General Public License * along. PJ_IS_BIG_ENDIAN # error Endianness must be declared for this processor.

May 26, 2014. But when I use them to my iOS project, it failed with Endianness must be declared for this processor , PJ_IS_LITTLE_ENDIAN is not defined!

This came to my mind after I learned the following from this question: where T : struct We, C# developers, all know the basics of C#. I mean declarations.

Lenovo’s fortunes and portfolio have been gathering pace especially since the release of the K3 Note, and the company has even declared that they do not. The presence of Wolfson 8281 processor with ESS Sabre 9018C2M DAC with.

Oracle 11g Database New Features – 1.1.1.8 Precompilers: Platform Endianness Support by Pro*COBOL. Oracle always stores Unicode data (UTF16) in Big Endian representation. Linux and Windows have Little.

The word processor is a powerful and empowering tool, far less about dominating the prone typewriter than about feeling humbled in the presence of infinite possibility. When he declared at MIT. his memoirs—the writer must come face.

pjproject on arm should force PJ_IS. #error Endianness must be declared for this processor # error Endianness must be declared for this processor.

Care must be taken to ensure that __COUNTER__ is not expanded prior to. GCC defines this macro if functions declared inline will be handled in GCC's. which is the prefix applied to CPU register names in assembly language for this target. out in a little-endian fashion, whereas the 16-bit subwords of a 32-bit quantity.

For most programming, even within the kernel, endianness is not a concern; things just work without much thought on the programmer’s part. Kernel code often must work with data encoded in a specific byte ordering which might not.

With the discovery of the arithmetic disaster inside Intel’s Pentium computer processor, those tethers are apparently flapping in a stiff wind. Yet we will continue to believe. During the Pentium Crisis, Intel declared. error-free just as.

Here I get the following error:. # error Endianness must be declared for this processor # endif. so raise error if endianness is not configured */

PJSIP build issue. Ask Question. it failed with Endianness must be declared for this processor, Pjsip compile error in iphone-simulator not able to setup in.

Windows Parity Check Memory Parity Error The message was ??MI Parity Check Memory Parity Error. My favorite was when Windows decided it wasn't Genuine and tried to stop Microsoft Security. I have aDell Inspiron E1705 laptop with Win XP Pro, SP3. I have 2 memory modules of 1 GB each for a total of 2 GB

make[1]: *** [res_pjsip/pjsip_distributor.o] Error 1 make: *** [res] Error 2. error Endianness must be declared for this processor # endif with

[ASTERISK-23315] Asterisk 12 rc1 doesn't compile on my raspberry. – Feb 15, 2014. res_pjsip/pjsip_distributor.c:141:21: error: 'pjsip_transaction' has no member named 'mutex'. If it is possible to pass endian-flags there.) Show.

6 Can someone explain the true landscape of Rails vs PHP deployment, particularly within the context of Reseller-based web hosting (e.g., Hostgator)?

RECOMMENDED: Click here to fix Windows errors and improve system performance

ON POSTED INNews