Error Executing Ant Tasks Org/apache/tools/ant/launch/locator

RECOMMENDED: If you have Windows errors then we strongly recommend that you download and run this (Windows) Repair Tool.

I am trying to deploy a war file on a remote JBoss 5.1.0.GA container, using a gradle. at.

Mastin Gallery. Mastin Espanol Gallery – All photos: © Copyright by the owners!

Build error – java.lang.ClassNotFoundException: – While Request Build viaAnt Enterprise Extension Rationa Build Agent , getting error java.lang.ClassNotFoundException:. Class Task. Handles an error line by logging it with the WARN priority. Performing a task consists of firing a task started event, configuring the task, executing it, and then firing task finished event.

UPDATE 1: Flash Builder 4, BlazeDS 4, and Spring 1.0.3 have all been release so you no longer have to use beta or nightly builds of these products. Use the production versions! UPDATE 2: I’ve done a second part to this screencast.

Feb 12, 2015. I uninstalled maven and ant. Installed maven and configured my settings.xml per our company configuration and am now able to build spark.

However, running the same Ant build in Bamboo fails with, Exception in. NoClassDefFoundError: org/apache/tools/ant/launch/Launcher Caused by: java. lang.

java.lang.NoSuchMethodError: Parse error: repoindex.xml[22] Specification mandate value for attribute.

Tftp Error 10061 Reliable communication between two peers is also supported with TCP/IP with error handling. You may want to use the smart addressing operation to control the destination of the data being transmitted (UDP only). TCP operation of this. Image management……………. 199 8.1 The Tivoli Configuration Manager and Tivoli. Nov 19, 2008.

I started seeing the following error today when using Maven and the AntRun Plugin. INFO] Error executing ant tasks Embedded error: java.lang.IllegalAccessError: tried to access method.

the ant taskdef fails because it cannot find the IzPackTask class. However, when I run maven from the subproject itself, it works fine. Not sure if this is related to The error message from maven.

java.lang.Object The Locator is a utility class. public static final String, ERROR_NOT_FILE_URI, Error string used when an.

getting an error while executing this task (Ant, Maven and Build. – </target> The Error which I get when running the target deploy is this, any clues why ?. NoSuchMethodError:

DOI Bookmark:

Ora-00913 Error Repadmin Error 1722 The Rpc Server Is Unavailable Error Unmarshaling Return Sep 8, 2011. After I placed them in their own Packages the java.rmi.UnmarshalException: error unmarshalling return; nested exception is: java.lang. Error unmarshaling, nested: EOFException. Error unmarshaling return header;. at sun.rmi.transport.StreamRemoteCall.executeCall. Oct 27, 2012. UnmarshalException: Error unmarshaling return

Key: HBX-1075 URL: Project: Hibernate Tools Issue Type: Bug Affects Versions: 3.2.1 Reporter: louie Attachments: We are reporting an issue during the.

RECOMMENDED: Click here to fix Windows errors and improve system performance