Error Expected Declaration Specifiers Or Before & Token


RECOMMENDED: If you have Windows errors then we strongly recommend that you download and run this (Windows) Repair Tool.

qtsdk-2010.05/qt/include/QtCore/qnamespace.h:1851:2: error: expected declaration specifiers before ';' token. In file included from././.

[CMake] Compilation error when compiling with apache httpd – Aug 26, 2009. [CMake] Compilation error when compiling with apache httpd. error: expected specifier-qualifier-list before 'apr_off_t' > In file included from. error: expected declaration specifiers or '. error: expected ')' before '*' token.

The syntax of the C programming language, the rules governing writing of software in the language, is designed to allow for programs that are extremely terse, have a.

. â__attribute__â before â_IO_sgetnâ In file included from sorting.c:10: /usr/ include/stdio.h:312: error: expected declaration specifiers or â.â.

before 'wint_t' /usr/include/ncurses/ncurses.h:1481: error: expected declaration specifiers or '.' before 'wint_t' make[2]: *** [alsamixer.o] Error 1.

Gimpel Software’s PC-lint and FlexeLint On-Line Demos. On-Line Message Reference for FlexeLint and PC-lint (aka FlexeLint for Windows)

4 ORA-01500 to ORA-02099 ORA-01500 failure in getting date/time. Cause: During CREATE DATABASE or ALTER TABLESPACE, there was a.

Where an attribute is expected, it is an ordinary syntax error (C2059) if the first token is not an identifier and a more specific error (C2485) if the identifier is not.

For code which uses Expat, however, the calling convention is specified. called for each declaration. So if, for instance, a start tag had three namespace declarations, then the StartNamespaceDeclHandler would be called three.

(32340711) Syncing 32-bit apps via iTunes now behaves as expected. (32356790. completion handler with either a callback URL containing an authentication token, or with an error. (32433374.

expected declaration specifiers or. before. expected declaration specifiers or. before ( token; Gcc 4.1 preprocessor outputs the error message from the.

before string constant scanf("%d %d",&a,&b); ^ /code_2438557.c:3:17: error: expected declaration specifiers or '.' before '&' token scanf("%d.

Friday, May 6, 2016. SCCM 2012 error codes & description (full list) 131072512 131072512 0 x07D00200 The client is successfully assigned with Group Policy Site.

Error: Expected declaration before '}' Token. error: expected unqualified-id. 26 27 28 29 30 31 32 33 34 35 36 37 38 39 40 41 42 43 44 45 46 47 48 49 50 51 52.

Hi, please help me with error. I want to run simple project below. I have a lot of errors below and.

expected declaration specifiers or '…' before '*' token. 0. expected declaration specifiers or '. Error "Expected declaration in specifiers before 'if'.

Learn, Share, Build. Each month, over 50 million developers come to Stack Overflow to learn, share their knowledge, and build their careers. Join the world's.

Updated: 26 Mar 2009. error: expected ')' before '*' token code/client/client.h:42: error: expected declaration specifiers or '.

You can search for any kind of error, not just those that begin with ‘ORA-‘. If you do not have an Internet connection, you can look up error messages and other.

SCCM error codes details would be really helpful for an Intune ConfigMgr Administrator. All credit to this error codes goes to Nasiri El Makrini !! We all are.

Format Crc Error my external drive developed a CRC error,i was able to recover all my files using testdisk and now i want to reformat it and get it working again.however, formatting. Ethernet frame – The last field is CRC which is used to detect the error. Now, let’s study each field of

RECOMMENDED: Click here to fix Windows errors and improve system performance

ON POSTED INNews