Error Loading Shared Library File Too Short


RECOMMENDED: If you have Windows errors then we strongly recommend that you download and run this (Windows) Repair Tool.

Http Error 500.13 – Server Too Busy Internet Information Services Hospitals in California – United States – Lists of hospitals in each United States, state and district: A: Alabama, Alaska, Arizona, arkansas C: California, Colorado, Connecticut HTTP Error 500.13 – Server error: Web server is too busy. Internet Information Services (IIS) Technical Information (for support personnel). with many sites

As iOS has improved over the years, so too has the experience for getting "real.

/opt/splunk/bin/splunkd: error while loading shared libraries: libmongoc-1.0.so.0: cannot open shared object file: No such file or directory.

From one of my customers I got an application. When I try to run it I got following error error while loading shared libraries:./libvtkWidgets.so.5.4: file too short.

Error while loading shared libraries. error while loading shared libraries: /lib/libacl.so.1: file too short. No such file or directory configure: error:.

Error While Copying Content To A Stream Develop 1 Limited Blog | 'Error while copying content to a stream. – Jul 26, 2014. 'Error while copying content to a stream' when pushing to Git. Whilst pushing a recent commit on SparkleXRM I recieved the following error: For IAM reasons, you’ll sometimes get a permission error. However, when

Click upload and attach your CSV or TXT file. Then name your audience and then click ‘Save.’ Now you have a separate audience you can use Facebook Ads to.

Jun 24, 2013. In IBM HTTP Server logs we were getting error "Error while loading shared libraries: libstdc++.so.6: cannot open shared object file: No such file.

Now when I power up, after GRUB starts, I get this error: Loading Linux. error while loading shared libraries: /usr/lib/libpsl.so.5: file too short.

Keras is a Python library for deep learning that wraps the efficient numerical libraries Theano and TensorFlow. In this tutorial, you will discover how you can use.

If a task has already been executed on another computer, Gradle can skip the execution locally, and instead load the task’s outputs from. Gradle can build shared and static libraries and executables. Model variants of a native.

Alerts warn about vulnerabilities, incidents, and other security issues that pose a significant risk.

Tuning and Optimizing Red Hat Enterprise Linux for. – www.puschitz.com This article is a step by step guide for tuning and optimizing Red Hat Enterprise Linux on x86 and x86-64 platforms running Oracle 9i (32bit/64bit.

Our first problem was that the list was too small. We were spending. Eventually, the system runs short of memory and these queues need to be scanned by the.

But when I try to run it it gives the following error. file too short centos6 glibc steam. share | improve. error while loading shared libraries:.

shared libraries file too short. When I want to start the programm on my device I get this error: error while loading shared libraries:.

Improve your productivity and save time. Let your system work for you.

chroot: error while loading shared libraries: /lib/libc.so.6. –. error while loading shared libraries:. loading shared libraries: /lib/libc.so.6: file too short. Hi, this error chroot: error while loading shared.

2016年5月16日. 今天将linux上交叉编译的jrtplib和jthread库拷贝到ARM开发板的/usr/lib目录,结果 运行测试程序的时候报错,如博文标题所示。 交叉编译明明没有.

. error: [[email protected] ~]$ google-chrome /usr/bin/google-chrome: error while loading shared libraries: /lib64/libXss.so.1: file too short.

Gentoo Forums :: View topic – Missing shared library – libGL.so.1. – glxinfo: error while loading shared libraries: libGL.so.1: cannot open shared. while loading shared libraries: /usr/lib64/libGL.so.1: file too short.

Error E051 Canon Ir 330 Error While Copying Content To A Stream Develop 1 Limited Blog | 'Error while copying content to a stream. – Jul 26, 2014. 'Error while copying content to a stream' when pushing to Git. Whilst pushing a recent commit on SparkleXRM I recieved the following error: For IAM reasons, you’ll

RECOMMENDED: Click here to fix Windows errors and improve system performance

ON POSTED INNews