Error While Loading Shared Libraries Libtalloc


What is difference between Dynamic and Static library(Static and Dynamic linking)

RECOMMENDED: If you have Windows errors then we strongly recommend that you download and run this (Windows) Repair Tool.

Error C2511 Overloaded Compiler Errors C2500 Through C2599 | Microsoft Docs – The articles in this part of the documentation contain information about a subsection of the Visual C++ compiler errors. You can access the information here or, in. Script function not found: doGet – codesd.com – Script function not found: doGet I

I don't use samba but found this: http://rpmfind.net/linux/rpm2html/search.php?query=libtalloc.so.2 Maybe that page will help you to find and install the correct.

Error While Loading Shared Libraries Libtalloc – unidevsys.com – Home > Error While > Error While Loading Shared Libraries Libtalloc Error While Loading. com/forums/index.php?topic=43515. error while loading shared libraries:.

Google Toolbar Error During Installation If you use the toolbar’s search box, you’re sent to “an IAC Mywebsearch results page with advertisements and search results syndicated from Google. to install the Ask toolbar at all, although it does install with Chrome 24. An error. Des années que j’utilise et en fais la promo de votre
Event Id 10154 Error 1355 Josh Wieder: Fixing Event ID 10154 – The WinRM service failed to. Learn what other IT pros think about the 10154 Warning event generated by WinRM. Additional Data The error received was 1355: %%1355. The WinRM service failed to create the following SPN: <WSMAN/SERVER. domain.local; WSMAN/SERVER.> Additional Data The error

telepresence: error while loading shared libraries: libssl.so. –. error while loading shared libraries:. You received this message because you are subscribed to the Google Groups. libtalloc.so.2 -> libtalloc.so.2.0.

apparmor – Evince: error while loading shared libraries. – While opening a PDF, I get a permission denied error, while ROOT. [email protected]:~# evince *.pdf evince: error while loading shared libraries: libz.so.1: failed to map.

Samba Installation problems : libtalloc.so.1. Error while loading shared libraries : libtalloc.so. after some research found that it doesnt have the same error.

hey, i am trying to install a new samba server form the source.i have compiled as well as installed the package.now whenever i start the smbd service

RECOMMENDED: Click here to fix Windows errors and improve system performance