Xiosbase Error


RECOMMENDED: If you have Windows errors then we strongly recommend that you download and run this (Windows) Repair Tool.

c:\program files\microsoft visual studio\vc98\include\xiosbase(106) : error C2146: syntax error : missing ';' before identifier 'precision' c:\program files\microsoft.

I use libcurl and I get these errors without writting any code just compiling and I don't know why Fehler 49 error. libcurl compile errors. xiosbase 111 first.

Dec 7, 2015. It needs to be std::ios_base , like the other ios_base references in the function.

<div class="error-content text-center"> <div><span class="win-icon warning- symbol. UTILITY, VALARRAY, VECTOR, XIOSBASE. XLOCALE, XLOCINFO.

Compiler Errors C2500 Through C2599 Compiler Error C2504. Compiler Error C2504. Compiler Error C2504. Compiler Error C2500 · Compiler Error C2502.

Dec 9, 2014. Specify /EHsc c:program files (x86)microsoft visual studio 12.0vcinclude xiosbase(64) : error C2159: more than one storage class specified.

VS6 to VS2005 xiosbase compiler errors. \program files\microsoft visual studio 8\vc\include\xiosbase 202 Error 5 error C2334: unexpected token(s).

When I compile, I get error C2872: 'System': ambiguous symbol and the. How can I get typeinfo, xlocale and xiosbase to use ::System and not.

Errors in xiosbase – Experts-Exchange – I have barely begun a very simple application and these four errors have come up: error C2059: syntax error : 'constant' error C2334: unexpected token(s.

Dec 25, 2011. Does your #ifndef have a matching #endif at the end of the header file? What's the smallest use complete sample code that produces this.

Why I receive an error with xiosbase file. Learn more about xiosbase, qt Polyspace Code Prover

I am facing following Polyspace error while analyzing c++ code. Can any one help me in resolving this issue. Thanks in advance. "c:Program File (x86)Microsoft Visual Studio 9.0includexiosbase, line 290 (column 13): Limitation:.

Example of a C++ compiler listing 15694A01 V1.13 z/OS XL C++ //’CBC.SCCNSAM(CCNUBRC. bio.ok()) { 26 | cerr << "Error in birthdate specification – format is yyyy/mm/dd"; 27 | code = 8; 28 | } 29 | else { 30 | cout << bio; // write out.

includedinkumware64xiosbase:4: In file included from L:BorlandBCC101bin.includedinkumware64xlocale:5: L:BorlandBCC101bin.includedinkumware64cstring:17:15: error: conflicting types for ‘memchr’ inline void *.

C:PROGRAM FILES (X86)MICROSOFT SDKSWINDOWSV7.0AINCLUDESDKDDKVER.H D:PROGRAM FILES (X86)MICROSOFT VISUAL STUDIO 10.0VCINCLUDESTDIO.H D:PROGRAM FILES (X86)MICROSOFT VISUAL.

Note: C++ does not support default-int f:ProgramFiler-x86VSExpress-2013VCincludexiosbase(224) : error C2143: syntax error : missing ‘,’ before ‘&’ f:ProgramFiler-x86VSExpress-2013VCincludexiosbase(230) : error C4430:.

Error Enumerating Info For For more information about continuations. tracking from the tracking profile or use XML pipelines if you do need to track the payload data. When enumerating two-way ports, the TPE displays them as two logical ports, a send and a. Failed to enumerate objects. You're trying to open a database object
Error Reading Packet From Server Mysql In this blog post, we’ll discuss the possible reasons for MySQL “Got an error reading communication packet” errors. happen because a connection was not closed properly. The server can’t cause aborted connections unless there. I have the same problem with a 4.1.7 slave to a 3.23.51 master: 050220 17:00:03 [ERROR]

Presentation on theme: "THtml rev 2.0 Status and Plans of ROOT’s documentation facility Axel Naumann /.

RECOMMENDED: Click here to fix Windows errors and improve system performance